{"text_format":"1","workbook":"xlsx","n_sheets":7,"sheets":["VZT - bazén","udržovací výkon","Vypocet","Tabulky","Konstanty","Vzorce","Jednotky"],"not_rendered":{"charts":1,"images":4,"macros":1,"external_links":0,"defined_names":15,"comments":0,"pivot_tables":0},"unopened":[],"bounds":{"document_bytes":16777216,"sheet_cells":100000,"rows_first":2000,"rows_last":500,"rows_between":2000,"halvings":0,"cell_chars":16384,"cell_head_chars":4096},"cells_cut":0,"cells_raw":0,"read":"whole","date_system":"1900"}

{"sheet":"VZT - bazén","index":0,"n_rows":94,"n_cols":13,"rows_kept":94,"cut":false,"hidden":false,"merged":[[36,2,36,4],[86,2,86,4],[8,20,8,22],[26,2,29,6],[28,8,28,11],[27,8,27,12],[83,2,83,5],[39,9,39,11],[40,9,40,11],[42,9,42,11],[43,9,43,11],[44,9,44,11],[25,11,25,12],[23,11,23,12],[24,11,24,12],[17,2,17,3],[24,2,25,6],[6,2,6,3],[3,2,4,12],[19,11,19,12],[22,8,22,12],[20,11,20,12],[21,11,21,12],[12,8,12,10],[11,2,11,3],[48,4,48,5],[49,4,49,5],[33,2,34,12],[50,2,50,5],[47,2,47,5],[48,2,48,3],[49,2,49,3],[37,3,37,4],[38,3,38,4],[39,2,39,4],[41,3,41,4],[38,9,38,11],[41,9,41,11],[42,3,42,4],[37,9,37,11],[36,9,36,11],[54,2,54,7],[55,2,55,3],[57,2,57,3],[59,2,59,3],[51,4,51,5],[52,4,52,5],[51,2,51,3],[52,2,52,3],[56,2,56,7],[55,5,55,7],[60,4,60,6],[59,4,59,6],[61,4,61,7],[67,2,70,13],[14,2,15,2],[6,8,6,10],[7,8,7,9],[8,8,8,9],[11,8,11,10],[13,8,13,9],[14,8,14,9],[10,2,10,3],[16,8,16,9],[18,8,18,12],[40,2,40,4],[43,2,43,4],[44,3,44,4],[61,2,61,3],[60,2,60,3],[78,4,78,5],[77,4,77,5],[76,2,76,5],[84,4,84,5],[84,6,85,13],[81,4,81,5],[80,4,80,5],[79,4,79,5]]}
[null,null,"hodnoty editovatelné"]
[null,null,"mezihodnoty vypočítané"]
[null,null,"výsledky"]
[null,null,"ZADÁNÍ - VÝPOČET VÝKONU BAZÉNOVÉHO VÝMĚNÍKU"]
[]
[]
[null,null,"BUDOVA",null,null,null,null,null,"BAZÉN - VODNÍ PLOCHA"]
[null,null,"šířka ",10,null,null,null,null,"délka",null,6]
[null,null,"délka",15,null,null,null,null,"šířka",null,3]
[null,null,"výška ",6.2,null,null,null,null,"TYP BAZÉNU ",null,"vnitřní"]
[]
[null,null,"TEPLOTA VZDUCHU ",null,null,null,null,null,"TEPLOTA VODY"]
[null,null,"ti při provozu",29,"dop. hodnoty 28-30 °C",null,null,null,"rozdíl mezi teplotou vzduchu a vody "]
[null,null,"rh vzduchu - provoz",65,"dop. hodnoty 55-65 %",null,null,null,"(doporučení 2 až 3K)",null,1,"pro zmenšení odparu "]
[null,null,"parametry ti a rhi mimo provoz (pokles 2K)",{"$f":"D13-2","v":27},null,null,null,null,"teplota vody ",null,{"$f":"D13-K14","v":28},"vypočítává se z dt výše"]
[null,null,null,55]
[null,null,null,null,null,null,null,null,"ZAKRÝVÁNÍ BAZÉNU",null,"ano","doporučeno zakrývat"]
[null,null,"EXTERIÉR - PARAMETRY"]
[null,null,"návrhová teplota",-12,"min. teplota -20°C",null,null,null,"UŽÍVÁNÍ BAZÉNU"]
[null,null,"relativní vlhkosti",100,null,null,null,null,"dní v měsící ",null,10,"dní"]
{"$rows_left_out":75}
{"sheet":"udržovací výkon","index":1,"n_rows":49,"n_cols":15,"rows_kept":49,"cut":false,"hidden":false,"merged":[]}
["udržovací výkon"]
[]
["ohřev bazénové vody","Qcelkem",{"$f":"SUM(C6:C8)","v":48.288739871972822}," kWh/měs.","provoz",null,"mimo"]
[null,"Výměník",{"$f":"C3/24/C10","v":0.20120308279988675}," kW","odpar","přestup","odpar","přestup","slunce"]
[]
["měsíční potřeba tepla na ztráty přestupem tepla z vodní hladiny","Qp,z",{"$f":"C10/1000*C11*(C12*C14*(C19-C22)*C28/3600+C26*C14*(C15-C17))+C10/1000*(24-C11)*(C13*C14*(C19-C22)*C28/3600+C26*C14*(C15-C17))-0.85*C10*C27*C14","v":43.459865884775539}," kWh/měs.",{"$f":"C10/1000*C11*(C12*C14*(C19-C22)*C28/3600)","v":61.279169368740867},{"$f":"C10/1000*C11*(C26*C14*(C15-C17))","v":-2.7},{"$f":"C10/1000*(24-C11)*(C13*C14*(C19-C22)*C28/3600)","v":46.980696516034669},{"$f":"C10/1000*(24-C11)*(C26*C14*(C15-C17))","v":-62.1},{"$f":"-0.85*C10*C27*C14","v":0}]
["měsíční potřeba tepla na ohřev přiváděné studené vody","Qp,sv",{"$f":"C39*C40*C41*C42*(C44-C43)/3600000","v":0}," kWh/měs."]
["měsíční potřeba tepla pro pokrytí ztráty tepla přestupem (dno a stěny bazénu)","Qp,p",{"$f":"(C6+C7)*0.1/0.9","v":4.8288739871972819}," kWh/měs.","cca 10%"]
[]
["počet dní v měsíci","m",{"$f":"'VZT - bazén'!K20","v":10}," dní",null,"eulerova konstanta",null,"e",2.718281828446]
["denní provozní doba bazénu","Tp",{"$f":"'VZT - bazén'!K21","v":1}," hod"]
["součinitel přenosu - provoz","Bp",{"$f":"E12","v":4.1666666666666669E-4}," kg/h.m2.Pa",{"$f":"Vypocet!D28/36000","v":4.1666666666666669E-4}]
["součinitel přenosu - mimo provoz (zakrytý 0; odkrytý 0,00029)","Bn",{"$f":"E13","v":1.388888888888889E-5}," kg/h.m2.Pa",{"$f":"Vypocet!S35/36000","v":1.388888888888889E-5}]
["plocha vodní hladiny","Ab",{"$f":"Vypocet!D29","v":18}," m2"]
["teplota bazénové vody při provozu","t_w,p",{"$f":"Vypocet!W6","v":28}," °C"]
["teplota bazénové vody mimo provoz","t_w,n",{"$f":"C15-2","v":26}," °C"]
["střední teplota venkovního vduchu (den) - provoz","t_es",{"$f":"IF('VZT - bazén'!K10=\"vnitřní\",'VZT - bazén'!D13,'VZT - bazén'!D21)","v":29}," °C","rh",{"$f":"'VZT - bazén'!D14/100","v":0.65}]
["střední teplota venkovního vduchu (noc) - klidový režim","t_en",{"$f":"IF('VZT - bazén'!K10=\"vnitřní\",'VZT - bazén'!D15,'VZT - bazén'!D22)","v":27}," °C","rh",{"$f":"'VZT - bazén'!D16/100","v":0.55000000000000004}]
["tlak syté vodní páry při teplotě vzduchu rovné bazénu (při hladině) - provoz","p_v",{"$f":"$I$10^((1500.3+23.5*C15)/(234+C15))","v":3781.1605280747926}," Pa"]
["tlak syté vodní páry při teplotě vzduchu rovné bazénu (při hladině) - útlum","p_v_utlum",{"$f":"$I$10^((1500.3+23.5*C16)/(234+C16))","v":3362.3136938635676}]
{"$rows_left_out":30}
{"sheet":"Vypocet","index":2,"n_rows":66,"n_cols":26,"rows_kept":66,"cut":false,"hidden":false,"merged":[[26,3,26,6],[40,6,40,7],[27,3,27,6],[33,6,33,7]]}
[null,"Legenda",null,null,"hodnotu nutno zadat",null,null,null,null,"venkovní"]
[null,null,null,null,"hodnota se vypočítává ",null,null,null,null,"vnitřní"]
[null,null,null,null,"pomocná hodnota"]
["Parametry vzduchu",null,null,null,null,null,"interier klidovy rezim ",null,null,null,null,null,null,null,null,null,null,null,null,"teplota vody v bazenu "]
["Interiér","ti",null,null,null,null,"Interiér","ti",null,null,null,null,"Exteriér","te",null,"minimální teplota -20 ",null,null,null,"tw"]
["teplota",null,"ti",{"$f":"'VZT - bazén'!D13","v":29},"°C",null,"teplota",null,"ti",{"$f":"'VZT - bazén'!D15","v":27},"°C",null,"teplota",null,"te",{"$f":"'VZT - bazén'!D19","v":-12},"°C",null,null,"teplota",null,"ti",{"$f":"D22","v":28},"°C"]
["relativní vlhkost",null,"rhi",{"$f":"'VZT - bazén'!D14","v":65},"%",null,"relativní vlhkost",null,"rhi",{"$f":"'VZT - bazén'!D16","v":55},"%",null,"relativní vlhkost",null,"rhe",{"$f":"'VZT - bazén'!D20","v":100},"%",null,null,"relativní vlhkost",null,"rhi",65,"%"]
["entalpie s.v.",null,"hsvi",{"$f":"Konstanty!$F$2*Teplota","v":29290},"J/kg",null,"entalpie s.v.",null,"hsvi",{"$f":"Konstanty!$F$2*J6","v":27270},"J/kg",null,"entalpie s.v.",null,"hsve",{"$f":"Konstanty!$F$2*te","v":-12120},"J/kg",null,null,"entalpie s.v.",null,"hsvi",{"$f":"Konstanty!$F$2*W6","v":28280},"J/kg"]
["entalpie v.p.",null,"hvpi",{"$f":"$D$16*(Konstanty!$F$3*Teplota+Konstanty!$F$4)","v":4612.8141587777736},"J/kg",null,"entalpie v.p.",null,"hvpi",{"$f":"$D$16*(Konstanty!$F$3*J6+Konstanty!$F$4)","v":4551.9843870286795},"J/kg",null,"entalpie v.p.",null,"hvpe",{"$f":"P16*(Konstanty!F3*P6+Konstanty!F4)","v":312.47897440389437},"J/kg",null,null,"entalpie v.p.",null,"hvpi",{"$f":"$D$16*(Konstanty!$F$3*W6+Konstanty!$F$4)","v":4582.399272903227},"J/kg"]
["entalpie ",null,"hi",{"$f":"D8+D9","v":33902.814158777772},"J/kg",null,"entalpie ",null,"hi",{"$f":"J8+J9","v":31821.984387028679},"J/kg",null,"entalpie ",null,"he",{"$f":"IF(P8<0,P9-P8,P8+P9)","v":12432.478974403894},"J/kg",null,null,"entalpie ",null,"hi",{"$f":"W8+W9","v":32862.399272903225},"J/kg"]
[null,null,null,{"$f":"D10/1000","v":33.902814158777772},"kJ/kg",null,null,null,null,{"$f":"J10/1000","v":31.821984387028678},"kJ/kg",null,null,null,null,{"$f":"P10/1000","v":12.432478974403894},"kJ/kg",null,null,null,null,null,{"$f":"W10/1000","v":32.862399272903225},"kJ/kg"]
["tlak nasycené vodní páry",null,"p''vpi",{"$f":"Konstanty!$F$12^((1500.3+23.5*D6)/(234+D6))","v":4007.0776556845663},"Pa",null,"tlak nasycené vodní páry",null,"p''vpi",{"$f":"Konstanty!$F$12^((1500.3+23.5*J6)/(234+J6))","v":3566.3942301284278},"Pa",null,"tlak nasycené vodní páry",null,"p''vpe",{"$f":"Konstanty!$F$12^((1500.3+23.5*P6)/(234+P6))","v":241.73397334709176},"Pa",null,null,"tlak nasycené vodní páry",null,"p''vpi",{"$f":"Konstanty!$F$12^((1500.3+23.5*W6)/(234+W6))","v":3781.1605280747926},"Pa",null,{"$f":"2.718^(28.926-(6148/(273.15+te)))","v":217.76491530985223}]
["tlak  vodní páry",null,"pvpi",{"$f":"(D7/100)*D12","v":2604.600476194968},"Pa",null,"tlak  vodní páry",null,"pvpi",{"$f":"(J7/100)*J12","v":1961.5168265706354},"Pa",null,"tlak  vodní páry",null,"pvpe",{"$f":"(P7/100)*P12","v":241.73397334709176},"Pa",null,null,"tlak  vodní páry",null,"pvpi",{"$f":"(W7/100)*W12","v":2457.7543432486154},"Pa"]
["tlak suchého vzduchu",null,"psvi",{"$f":"D18*Konstanty!$F$5*(Teplota+273.15)","v":98011.435128999976},"Pa",null,"tlak suchého vzduchu",null,"psvi",{"$f":"J18*Konstanty!$F$5*(J6+273.15)","v":97965.806624099991},"Pa",null,"tlak suchého vzduchu",null,"psve",{"$f":"P18*Konstanty!F5*(P6+273.15)","v":97980.877379099999},"Pa",null,null,"tlak suchého vzduchu",null,"psvi",{"$f":"W18*Konstanty!$F$5*(W6+273.15)","v":98032.849954199992},"Pa",null,"(93*T-3153,5)/(T-39,17)"]
["tlak směsi vlhkého vzduchu",null,"pi",{"$f":"D13+D14","v":100616.03560519495},"Pa",null,"tlak směsi vlhkého vzduchu",null,"pi",{"$f":"J13+J14","v":99927.323450670621},"Pa",null,"tlak směsi vlhkého vzduchu",null,"pe",{"$f":"P13+P14","v":98222.611352447086},"Pa",null,null,"tlak směsi vlhkého vzduchu",null,"pi",{"$f":"W13+W14","v":100490.6042974486},"Pa",null,{"$f":"(93*te-3153.5)/(te-39.17)","v":83.437561070940006}]
["měrná vlhkost vzduchu",null,"xi",{"$f":"(Konstanty!$F$5/Konstanty!$F$6)*(D13/D14)","v":1.6529829279645143E-2},"kg/kg s.v.",null,"měrná vlhkost vzduchu",null,"xi",{"$f":"(Konstanty!$F$5/Konstanty!$F$6)*(J13/J14)","v":1.2454363016418361E-2},"kg/kg s.v.",null,"měrná vlhkost vzduchu",null,"xe",{"$f":"(Konstanty!F5/Konstanty!F6)*(P13/P14)","v":1.5346182811310008E-3},"kg/kg s.v.",null,null,"měrná vlhkost vzduchu",null,"xi",{"$f":"(Konstanty!$F$5/Konstanty!$F$6)*(W13/W14)","v":1.5594478100134221E-2},"kg/kg s.v."]
[null,null,null,{"$f":"D16*1000","v":16.529829279645142},"g/kg s.v.",null,null,null,null,{"$f":"J16*1000","v":12.454363016418361},"g/kg s.v.",null,null,null,null,{"$f":"P16*1000","v":1.5346182811310007},"g/kg s.v.",null,null,null,null,null,{"$f":"W16*1000","v":15.59447810013422},"g/kg s.v."]
["hustota vzduchu při t",null,null,{"$f":"VLOOKUP(Teplota,Tabulky!$V$15:$AF$75,9,0)","v":1.1299999999999999},"kg/m3",null,"hustota vzduchu při t",null,null,{"$f":"VLOOKUP(J6,Tabulky!V15:AF75,9,0)","v":1.137},"kg/m3",null,"hustota vzduchu při t",null,null,{"$f":"VLOOKUP(te,Tabulky!V15:AF75,9,0)","v":1.3069999999999999},"kg/m3",null,null,"hustota vzduchu při t",null,null,{"$f":"VLOOKUP(W6,Tabulky!$V$15:$AF$75,9,0)","v":1.1339999999999999},"kg/m3"]
[]
["Bazén",null,null,null,null,null,null,null,"rozměry bazénu"]
{"$rows_left_out":47}
{"sheet":"Tabulky","index":3,"n_rows":666,"n_cols":34,"rows_kept":666,"cut":false,"hidden":false,"merged":[[12,27,13,27],[12,28,13,28],[12,29,13,29],[12,30,13,30],[12,31,13,31],[12,22,13,22],[12,23,13,23],[12,24,13,24],[12,25,13,25],[12,26,13,26],[11,15,12,15],[11,16,12,16],[3,8,3,10],[4,8,4,10],[5,8,5,10],[6,8,6,10],[11,9,12,9],[11,12,12,12],[11,13,12,13],[11,8,12,8],[1,8,2,10],[2,0,2,5],[9,1,10,1],[9,3,10,3],[9,2,10,2],[9,0,10,0],[9,4,10,4],[9,5,10,5],[9,6,10,6],[9,7,10,7],[3,0,3,5],[4,0,4,5],[5,0,5,5],[6,0,6,5],[7,0,7,5],[140,22,143,22],[144,22,144,26],[155,22,155,26],[157,22,157,26],[163,22,163,26]]}
["Součinitel odparu vody z vodní hladiny (100Pa)",null,null,null,null,null,"ε",null,"Produkce vlhkosti "]
[null,null,null,null,null,null,"[g/(hPa.m2.h)]",null,"Zdroj",null,null,"Intezita"]
["vodní plocha zakryta folií",null,null,null,null,null,0.5,null,null,null,null,"g/h"]
["klidná vodní hladina",null,null,null,null,null,5,null,"člověk - lehká práce",null,null,"30-60"]
["bazény RD s malou obsazeností",null,null,null,null,null,15,null,"člověk - středně těžka práce",null,null,"60-150"]
["bazény - normální provoz",null,null,null,null,null,20,null,"člověk - těžká práce",null,null,"150-300",null,null,null,null,null,null,null,null,null," "]
["bazény s vodními atrakcemi",null,null,null,null,null,28,null,"sprchování",null,null,2600]
["bazény s vlnami",null,null,null,null,null,35]
["tlak nasycene vodni pary nad vodou ",null,null,null,"tlak nasycene vodni pary nad ledem ",null,null,null,"Goff-Gratchova rovnice",null,null,"10,79574*(1-(273,16/V15))+5,028*LOG(V15/273,16)+(1,50475*(10^-4))*(1-10^(-8,2969*((V15/273,16)-1)))+(0,42873*(10^-3))*(10^(4,76955*(1-(273,16/V15)))-1)+0,78614"]
["Teplota","tlak syté páry","Teplota","tlak syté páry","Teplota","tlak syté páry","Teplota","tlak syté páry"]
[null,null,null,null,null,null,null,null,"tabulka",null,null,null,"Tlaky syté páry vzduchu při konkrétní teplotě"]
["T ","Log(p´´vp)","t ","p´´vp","T ","Log(p´´vp)","t ","p´´vp","Teplota","tlak syté páry",null,null,"Teplota","tlak syté páry",null,"Teplota","tlak syté páry",null,null,null,null,"p (kPa)",84,86,88,90,92,94,96,98,100,101.4]
["[K]",null,"[°C]","[Pa]","[K]",null,"[°C]","[Pa]",null,null,null,null,null,null,null,null,null,null,null,null,null,"h(m)",1502,1315,1132,953,778,606,438,273,111,0]
[249.15,{"$f":"10.79574*(1-(273.16/A14))+5.028*LOG10(A14/273.16)+(1.50475*(10^-4))*(1-10^(-8.2969*((A14/273.16)-1)))+(0.42873*(10^-3))*(10^(4.76955*(1-(273.16/A14)))-1)+0.78614","v":-0.45605615189548587},{"$f":"A14-273.15","v":-23.999999999999972},{"$f":"(10^B14)*100","v":34.989992396174188},{"$f":"G14+273.15","v":249.14999999999998},{"$f":"-9.09718*((273.16/E14)-1)-3.56654*(LOG10(273.16/E14))+0.876793*(1-(E14/273.16))+LOG10(6.1071)","v":-0.15627660482798089},-24,{"$f":"(10^F14)*100","v":69.778783715113391},"t ","p''vp",null,null,"t ","p''vp","ln(p''vp)","t ","p''vp","ln(p''vp)",null,null,null,"t (°C)",null,null,null,null,null,null,null,null,null,null,"-"]
[250.15,-0.39993152194212767,-22.999999999999972,39.816994766988167,250.14999999999998,-0.11341051802807678,-23,77.017511477879339,"[°C]","k[Pa]",null,null,"[°C]","[Pa]","[Pa]","[°C]","[Pa]","[Pa]",null,null,null,-20,1.1559999999999999,1.1830000000000001,1.2110000000000001,1.238,1.266,1.2929999999999999,1.321,1.3480000000000001,1.3759999999999999,1.395,0,{"$f":"AF15-AF16","v":5.0000000000001155E-3}]
[251.15,-0.34422196537895189,-21.999999999999972,45.266616573194078,251.14999999999998,-7.0886695959459955E-2,-22,84.940204849629879,-15,0.1651,null,null,-15,{"$f":"Konstanty!$F$12^O16","v":165.73480010913977},{"$f":"28.926-(6148/(273.15+I16))","v":5.1103889211698572},-15,{"$f":"Konstanty!$F$12^R16","v":165.73480010913977},{"$f":"28.926-(6148/(273.15+P16))","v":5.1103889211698572},null,null,null,-19,1.151,1.179,1.206,1.234,1.2609999999999999,1.288,1.3160000000000001,1.343,1.371,1.39,0,{"$f":"AF16-AF17","v":6.0000000000000053E-3}]
[252.15,-0.28892246381889863,-20.999999999999972,51.413543386712476,252.14999999999998,-2.8701164244131494E-2,-21,93.604954338345365,-14,0.18099999999999999,null,null,-14,{"$f":"Konstanty!$F$12^O17","v":181.68744291875007},5.2022878641713248,-14.9,{"$f":"Konstanty!$F$12^R17","v":167.2702624231965},5.1196108422071624,null,null,null,-18,1.147,1.1739999999999999,1.2010000000000001,1.2290000000000001,1.256,1.2829999999999999,1.3109999999999999,1.3380000000000001,1.365,1.3839999999999999,1E-3,4.9999999999998934E-3]
[253.15,-0.23402808960350951,-19.999999999999972,58.340736902187842,253.14999999999998,1.314998946961321E-2,-20,103.07420396730933,-13,0.19819999999999999,null,null,-13,{"$f":"Konstanty!$F$12^O18","v":199.03492260428155},5.2934802998270207,-14.8,{"$f":"Konstanty!$F$12^R18","v":168.8187449247142},5.1288256241532757,null,null,null,-17,1.1419999999999999,1.17,1.1970000000000001,1.224,1.2509999999999999,1.278,1.306,1.333,1.36,1.379,1E-3,4.9999999999998934E-3]
[254.15,-0.17953400322165458,-18.999999999999972,66.140275072249679,254.14999999999998,5.4670616718351717E-2,-19,113.41503123338568,-12,0.217,null,null,-12,{"$f":"Konstanty!$F$12^O19","v":217.8865129020885},5.3839743442465995,-14.7,{"$f":"Konstanty!$F$12^R19","v":170.38034734650779},5.138033275295026,null,null,null,-16,1.1379999999999999,1.165,1.1919999999999999,1.2190000000000001,1.246,1.2729999999999999,1.3,1.3280000000000001,1.355,1.3740000000000001,1E-3,6.0000000000000053E-3]
[255.15,-0.12543545083873431,-17.999999999999972,74.914269526778838,255.14999999999998,9.5864509406341503E-2,-18,124.69944179520813,-11,0.2374,null,null,-11,{"$f":"Konstanty!$F$12^O20","v":238.35901171274517},5.473777989700551,-14.6,{"$f":"Konstanty!$F$12^R20","v":171.9551700989621},5.1472338039063956,null,null,null,-15,1.133,1.1599999999999999,1.1870000000000001,1.214,1.2410000000000001,1.268,1.2949999999999999,1.3220000000000001,1.349,1.3680000000000001,1E-3,5.0000000000001155E-3]
{"$rows_left_out":647}
{"sheet":"Konstanty","index":4,"n_rows":17,"n_cols":11,"rows_kept":17,"cut":false,"hidden":false,"merged":[[1,0,1,3],[2,0,2,3],[3,0,3,3],[4,0,4,3],[5,0,5,3],[15,0,15,3],[16,0,16,3],[1,8,1,9],[2,8,2,9],[3,8,3,9],[6,8,6,9],[7,8,7,9],[8,8,8,9],[7,0,7,3],[8,0,8,3],[9,0,9,3],[10,0,10,3],[11,0,11,3],[12,0,12,3],[9,8,9,9],[6,0,6,3],[10,8,10,9],[11,8,11,9],[12,8,12,9],[13,8,13,9],[13,0,13,3]]}
["Konstanty",null,null,null,null,null,null,"Pozn"]
["Měrná tepelná kapacita s.v.",null,null,null,"csv",1010,"J/kg.K","s.v.","suchý vzduch"]
["Měrná tepelná kapacita v.p.",null,null,null,"cvp",1840,"J/kg.K","v.p.","vodní pára"]
["výparné teplo vody",null,null,null,"l",225700,"J/kg"]
["měrná plynová konstanta s.v.",null,null,null,"Rsv",287.06200000000001,"J/kg.K","s.v.","suchý vzduch",null,{"$f":"F5/F6","v":0.62201950162513542}]
["měrná plynová konstanta v.p.",null,null,null,"Rvp",461.5,"J/kg.K","v.p.","vodní pára"]
["tlak v 0 mnm",null,null,null,"p0",101.325,"kPa"]
["hustota vzduchu v 0mnm",null,null,null,"ρvz",1.2250000000000001,"kg/m3"]
["Plynová konstanta",null,null,null,"R",8.3143200000000004,"J/mol.K"]
["Molární hmotnost s.v.",null,null,null,"Msv",28.96,"kg/mol","s.v.","suchý vzduch"]
["Molární hmotnost v.p.",null,null,null,"Mvp",18.02,"kg/mol","v.p.","vodní pára"]
["eulerova konstanta",null,null,null,"e",2.718281828446,"[-]"]
["gravitační zrychlení",null,null,null,"g",9.8066499999999994,"m/s2"]
["tlak v 0 nadmořské výšce",null,null,null,"p0",101325,"Pa"]
["výparné teplo vody",null,null,null,"l",2257000,"J/kg"]
["hustota v urcite nadm vysce",null,null,null,"vyska",273,"m",{"$f":"$F$8*$F$12^(($F$8*$F$13*F16)/$F$14)","v":1.2652982563535966},"kg/m3"]
["tlak v urcite nadm vysce",null,null,null,null,null,null,{"$f":"F14*$F$12^(($F$8*$F$13*F16)/$F$14)","v":104658.2414898189},"Pa"]

{"sheet":"Vzorce","index":5,"n_rows":109,"n_cols":9,"rows_kept":109,"cut":false,"hidden":false,"merged":[]}
["tlak vzduchu pro H <11000m"]
["t=15-0,0065h"]
["p=1013,25(1-h/44308)^5,2553"]
["q=1,225(1-h/44308)^4,2553"]
[]
["p=p0(1-g*h/cpd*T0)^cpd/Rd"]
[]
["Tlak vzduchu",null,null,null,null,null,null,null,"Jednotka"]
["p=psv+pvp",null,"psv - parcialni tlak s.v",null,null,null,null,null,"Pa"]
[null,null,"pvp - parcialni tlak vodni pary",null,null,null,null,null,"Pa"]
[]
["Parciální tlak nasycené vodní páry"]
[]
[null,null,"p´´vp - parcialni tlak nasycené vodní páry",null,null,null,null,null,"Pa"]
[]
["Entalpie "]
["h=hsv+x*hvp",null,"hsv - entalpie sucheho vzduchu J/kg",null,null,null,null,null,"J/kg"]
[null,null,"hvp - entalpie vodni pary J/kg",null,null,null,null,null,"J/kg"]
[null,null,"x - mnozstvi vody v suchem vzduchu kg/kg s.v.",null,null,null,null,null,"kg/kg s.v."]
[]
{"$rows_left_out":90}
{"sheet":"Jednotky","index":6,"n_rows":43,"n_cols":6,"rows_kept":43,"cut":false,"hidden":false,"merged":[[0,3,0,4]]}
[null,"Značka ","index","veličina",null,"jednotka"]
[null,"t",null,"teplota",null,"°C"]
[null,"rh",null,"relativní vlhkost",null,"%"]
[null,"h",null,"měrná entalpie",null,"J/kg"]
[null,null,"sv",null,"suchého vzduchu"]
[null,null,"vp",null,"vodní páry"]
[null,"p",null,"tlak vzduchu",null,"Pa"]
[null,null,"sv",null,"suchého vzduchu"]
[null,null,"vp",null,"vodní páry"]
[null,"p''",null,"tlak nasycené vodní páry",null,"Pa"]
[null,"x",null,"měrná vlhkost",null,"g/kg s.v."]
[null,"Δx",null,"změna měrné vlhkosti",null,"g/kg s.v."]
[null,"ρ",null,"hustota vzduchu",null,"kg/m3"]
[null,null,"e",null,"exteriérová"]
[null,null,"i ",null,"interiérová"]
[null,null,"vyp",null,"na výparníku"]
[null,null,4,null,"předehřev exteriérového vzduchu"]
[null,null,"4' ",null,"po smíšení"]
[null,null,5,null,"za kondenzátorem"]
[null,null,"před",null,"předehřev"]
{"$rows_left_out":23}